BDBM50017460 1-(2-Butoxy-phenyl)-piperazine::CHEMBL9452
SMILES CCCCOc1ccccc1N1CCNCC1
InChI Key InChIKey=YNPHKRWUIFAKLL-UHFFFAOYSA-N
Data  7 KI
  Tab Delimited (TSV)   2D SDfile   Computed 3D by Vconf -m prep SDfile
Find this compound or compounds like it in BindingDB:
Activity Spreadsheet -- Enzyme Inhibition Constant Data from BindingDB
Found 1 hit for monomerid = 50017460
TargetD(2) dopamine receptor(Rattus norvegicus (rat))
Mcneil Pharmaceutical And Janssen Research Foundation Worldwide
Curated by ChEMBL
LigandPNGBDBM50017460(1-(2-Butoxy-phenyl)-piperazine | CHEMBL9452)
Affinity DataKi:  244nM. Assay description: Binding affinity against rat Dopamine receptor D2.
In DepthDetails ArticlePubMed